{"text_format":"1","workbook":"xlsx","n_sheets":18,"sheets":["オーグメント2","アイテム検索(findAll)","アイテム検索(GearSwap)","進捗メモ","花鳥風月","アビセア","リンバス","空４神","七元徳","ログ","Char6","Char5","Char4","Char3","Char2","Char1","CSV","tmp"],"not_rendered":{"charts":0,"images":14,"macros":1,"external_links":0,"defined_names":23,"comments":2,"pivot_tables":0},"unopened":[],"bounds":{"document_bytes":16777216,"sheet_cells":100000,"rows_first":2000,"rows_last":500,"rows_between":2000,"halvings":0,"cell_chars":16384,"cell_head_chars":4096},"cells_cut":0,"cells_raw":0,"read":"whole","date_system":"1900"}

{"sheet":"オーグメント2","index":0,"n_rows":159,"n_cols":22,"rows_kept":159,"cut":false,"hidden":false,"merged":[]}
["逆解析用定義シート ver2.62"]
["Objectives:"]
["各キャラのシートのE列にはGearSwapが書き出したオーグメント情報が表示されるが、① このままではどのモグチケットが使われたのかすぐには分からない。② 強化漏れのNQ装備があるかどうかをチェックできない。"]
["１．使用されているモグチケット情報を分かるようにする。"]
["２．英文オーグメントではなく日本語に置き換える。"]
["３．Gオーグメントの解析"]
[]
["「オーグメント2」シートにはマッピング情報(対応表3: モグチケット⇔英文オーグメント)が定義されており、これと完全マッチしたオーグメントであれば、Tier,色,タイプ,NQ/HQがD列に表示される。"]
["この対比表はすべてのオーグメントをカバーしておらず、手作業で作成した対比表のため入力ミスのリスクもある。そのためダブルチェックを兼ねて次のような処理でモグチケットを特定している。",null,null,null,null,null,null,"保守手順マニュアル"]
[]
{"$rows_left_out":150}
{"sheet":"アイテム検索(findAll)","index":1,"n_rows":11,"n_cols":8,"rows_kept":11,"cut":false,"hidden":false,"merged":[]}
["アイテム検索(findAll)"]
[null,null,null,null,null,null,"CTRL+SHIFT+G","アイテム検索(GearSwap) シートを表示"]
[null,null,null,null,null,null,"CTRL+SHIFT+F","アイテム検索(findAll) シートを表示"]
[null,null,null,null,null,null,"CTRL+SHIFT+S","キャラ名が記載されているセルを選択して、CTRL+SHIFT+Sでそのシートに移動"]
["finaAll CSV:",null,"C:\\Program Files (x86)\\Windower4\\addons\\findAll\\data\\result.CSV",null,null,null,"CTRL+SHIFT+B","CTRL+SHIFT+Sでシート移動するときに表示していたシートに戻る"]
[null,null,null,null,null,null,"CTRL+SHIFT+O","ハイライトしたセルに書かれたluaファイルを開く"]
["検索キーワード："]
[]
[]
[]
{"$rows_left_out":2}
{"sheet":"アイテム検索(GearSwap)","index":2,"n_rows":24,"n_cols":7,"rows_kept":24,"cut":false,"hidden":false,"merged":[]}
["アイテム検索(GearSwap)"]
[null,null,null,null,null,"CTRL+SHIFT+G","アイテム検索(GearSwap) シートを表示"]
[null,null,null,null,null,"CTRL+SHIFT+F","アイテム検索(findAll) シートを表示"]
[null,null,null,null,null,"CTRL+SHIFT+S","キャラ名が記載されているセルを選択して、CTRL+SHIFT+Sでそのシートに移動"]
["GearSwap export:","C:\\Program Files (x86)\\Windower4\\addons\\GearSwap\\data\\export",null,null,null,"CTRL+SHIFT+B","CTRL+SHIFT+Sでシート移動するときに表示していたシートに戻る"]
["Windower4 res:","C:\\Program Files (x86)\\Windower4\\res",null,null,null,"CTRL+SHIFT+O","ハイライトしたセルに書かれたluaファイルを開く"]
[null,null,null,null,null,"CTRL+SHIFT+C","G列↓のセルをハイライトして実行すると、Gオーグメントの元になったアイテムを表示"]
["アイテム名："]
["オーグメント：1"]
[2]
{"$rows_left_out":15}
{"sheet":"進捗メモ","index":3,"n_rows":106,"n_cols":9,"rows_kept":106,"cut":false,"hidden":false,"merged":[]}
[]
[]
[]
[]
[null,null,"Char1","Char2","Char3","Char4","Char5","Char6"]
[]
[]
["テンプレート：AF2防具"]
[null,"サマナーホーン",{"$f":"IF( ISNA(MATCH(C$5&$B9, CSV!$E:$E, 0)), \"\", \"〇\")","v":""},{"$f":"IF( ISNA(MATCH(D$5&$B9, CSV!$E:$E, 0)), \"\", \"〇\")","v":""},{"$f":"IF( ISNA(MATCH(E$5&$B9, CSV!$E:$E, 0)), \"\", \"〇\")","v":""},{"$f":"IF( ISNA(MATCH(F$5&$B9, CSV!$E:$E, 0)), \"\", \"〇\")","v":""},{"$f":"IF( ISNA(MATCH(G$5&$B9, CSV!$E:$E, 0)), \"\", \"〇\")","v":""},{"$f":"IF( ISNA(MATCH(H$5&$B9, CSV!$E:$E, 0)), \"\", \"〇\")","v":""},"ザルカ、タブナジア"]
[null,"サマナーダブレット",{"$f":"IF( ISNA(MATCH(C$5&$B10, CSV!$E:$E, 0)), \"\", \"〇\")","v":""},{"$f":"IF( ISNA(MATCH(D$5&$B10, CSV!$E:$E, 0)), \"\", \"〇\")","v":""},{"$f":"IF( ISNA(MATCH(E$5&$B10, CSV!$E:$E, 0)), \"\", \"〇\")","v":""},{"$f":"IF( ISNA(MATCH(F$5&$B10, CSV!$E:$E, 0)), \"\", \"〇\")","v":""},{"$f":"IF( ISNA(MATCH(G$5&$B10, CSV!$E:$E, 0)), \"\", \"〇\")","v":""},{"$f":"IF( ISNA(MATCH(H$5&$B10, CSV!$E:$E, 0)), \"\", \"〇\")","v":""},"ボスディン、タブナジア"]
{"$rows_left_out":97}
{"sheet":"花鳥風月","index":4,"n_rows":57,"n_cols":23,"rows_kept":57,"cut":false,"hidden":false,"merged":[]}
[]
[]
[]
[]
[null,null,"トリガー","戦利品","入手割賦","Char1",null,null,"Char2",null,null,"Char3",null,null,"Char4",null,null,"Char5",null,null,"Char6"]
["マムージャT1","ヴルパングエ","地獄蝶々","ヴルパングエの翅","蒸栗の割符",{"$f":"IF( ISNA(MATCH($F$5&C6, CSV!$E:$E, 0)), \"\", \"〇\")","v":""},{"$f":"IF( ISNA(MATCH($F$5&D6, CSV!$E:$E, 0)), \"\", \"〇\")","v":""},{"$f":"IF( ISNA(MATCH($F$5&E6, CSV!$E:$E, 0)), \"\", \"〇\")","v":""},{"$f":"IF( ISNA(MATCH($I$5&C6, CSV!$E:$E, 0)), \"\", \"〇\")","v":""},{"$f":"IF( ISNA(MATCH($I$5&D6, CSV!$E:$E, 0)), \"\", \"〇\")","v":""},{"$f":"IF( ISNA(MATCH($I$5&E6, CSV!$E:$E, 0)), \"\", \"〇\")","v":""},{"$f":"IF( ISNA(MATCH($L$5&C6, CSV!$E:$E, 0)), \"\", \"〇\")","v":""},{"$f":"IF( ISNA(MATCH($L$5&D6, CSV!$E:$E, 0)), \"\", \"〇\")","v":""},{"$f":"IF( ISNA(MATCH($L$5&E6, CSV!$E:$E, 0)), \"\", \"〇\")","v":""},{"$f":"IF( ISNA(MATCH(O$5&C6, CSV!$E:$E, 0)), \"\", \"〇\")","v":""},{"$f":"IF( ISNA(MATCH(O$5&D6, CSV!$E:$E, 0)), \"\", \"〇\")","v":""},{"$f":"IF( ISNA(MATCH(O$5&E6, CSV!$E:$E, 0)), \"\", \"〇\")","v":""},{"$f":"IF( ISNA(MATCH(R$5&C6, CSV!$E:$E, 0)), \"\", \"〇\")","v":""},{"$f":"IF( ISNA(MATCH(R$5&D6, CSV!$E:$E, 0)), \"\", \"〇\")","v":""},{"$f":"IF( ISNA(MATCH(R$5&E6, CSV!$E:$E, 0)), \"\", \"〇\")","v":""},{"$f":"IF( ISNA(MATCH(U$5&$C6, CSV!$E:$E, 0)), \"\", \"〇\")","v":""},{"$f":"IF( ISNA(MATCH(U$5&$D6, CSV!$E:$E, 0)), \"\", \"〇\")","v":""},{"$f":"IF( ISNA(MATCH(U$5&$E6, CSV!$E:$E, 0)), \"\", \"〇\")","v":""}]
[null,"チャムロッシュ","花蜜","チャムロッシュの嘴",null,{"$f":"IF( ISNA(MATCH($F$5&C7, CSV!$E:$E, 0)), \"\", \"〇\")","v":""},{"$f":"IF( ISNA(MATCH($F$5&D7, CSV!$E:$E, 0)), \"\", \"〇\")","v":""},{"$f":"IF( ISNA(MATCH($F$5&E7, CSV!$E:$E, 0)), \"\", \"〇\")","v":""},{"$f":"IF( ISNA(MATCH($I$5&C7, CSV!$E:$E, 0)), \"\", \"〇\")","v":""},{"$f":"IF( ISNA(MATCH($I$5&D7, CSV!$E:$E, 0)), \"\", \"〇\")","v":""},{"$f":"IF( ISNA(MATCH($I$5&E7, CSV!$E:$E, 0)), \"\", \"〇\")","v":""},{"$f":"IF( ISNA(MATCH($L$5&C7, CSV!$E:$E, 0)), \"\", \"〇\")","v":""},{"$f":"IF( ISNA(MATCH($L$5&D7, CSV!$E:$E, 0)), \"\", \"〇\")","v":""},{"$f":"IF( ISNA(MATCH($L$5&E7, CSV!$E:$E, 0)), \"\", \"〇\")","v":""},{"$f":"IF( ISNA(MATCH(O$5&C7, CSV!$E:$E, 0)), \"\", \"〇\")","v":""},{"$f":"IF( ISNA(MATCH(O$5&D7, CSV!$E:$E, 0)), \"\", \"〇\")","v":""},{"$f":"IF( ISNA(MATCH(O$5&E7, CSV!$E:$E, 0)), \"\", \"〇\")","v":""},{"$f":"IF( ISNA(MATCH(R$5&C7, CSV!$E:$E, 0)), \"\", \"〇\")","v":""},{"$f":"IF( ISNA(MATCH(R$5&D7, CSV!$E:$E, 0)), \"\", \"〇\")","v":""},{"$f":"IF( ISNA(MATCH(R$5&E7, CSV!$E:$E, 0)), \"\", \"〇\")","v":""},{"$f":"IF( ISNA(MATCH(U$5&$C7, CSV!$E:$E, 0)), \"\", \"〇\")","v":""},{"$f":"IF( ISNA(MATCH(U$5&$D7, CSV!$E:$E, 0)), \"\", \"〇\")","v":""},{"$f":"IF( ISNA(MATCH(U$5&$E7, CSV!$E:$E, 0)), \"\", \"〇\")","v":""}]
[null,"チーズマニアのギギルン","ラットチーズ","ギギルンのケープ",null,{"$f":"IF( ISNA(MATCH($F$5&C8, CSV!$E:$E, 0)), \"\", \"〇\")","v":""},{"$f":"IF( ISNA(MATCH($F$5&D8, CSV!$E:$E, 0)), \"\", \"〇\")","v":""},{"$f":"IF( ISNA(MATCH($F$5&E8, CSV!$E:$E, 0)), \"\", \"〇\")","v":""},{"$f":"IF( ISNA(MATCH($I$5&C8, CSV!$E:$E, 0)), \"\", \"〇\")","v":""},{"$f":"IF( ISNA(MATCH($I$5&D8, CSV!$E:$E, 0)), \"\", \"〇\")","v":""},{"$f":"IF( ISNA(MATCH($I$5&E8, CSV!$E:$E, 0)), \"\", \"〇\")","v":""},{"$f":"IF( ISNA(MATCH($L$5&C8, CSV!$E:$E, 0)), \"\", \"〇\")","v":""},{"$f":"IF( ISNA(MATCH($L$5&D8, CSV!$E:$E, 0)), \"\", \"〇\")","v":""},{"$f":"IF( ISNA(MATCH($L$5&E8, CSV!$E:$E, 0)), \"\", \"〇\")","v":""},{"$f":"IF( ISNA(MATCH(O$5&C8, CSV!$E:$E, 0)), \"\", \"〇\")","v":""},{"$f":"IF( ISNA(MATCH(O$5&D8, CSV!$E:$E, 0)), \"\", \"〇\")","v":""},{"$f":"IF( ISNA(MATCH(O$5&E8, CSV!$E:$E, 0)), \"\", \"〇\")","v":""},{"$f":"IF( ISNA(MATCH(R$5&C8, CSV!$E:$E, 0)), \"\", \"〇\")","v":""},{"$f":"IF( ISNA(MATCH(R$5&D8, CSV!$E:$E, 0)), \"\", \"〇\")","v":""},{"$f":"IF( ISNA(MATCH(R$5&E8, CSV!$E:$E, 0)), \"\", \"〇\")","v":""},{"$f":"IF( ISNA(MATCH(U$5&$C8, CSV!$E:$E, 0)), \"\", \"〇\")","v":""},{"$f":"IF( ISNA(MATCH(U$5&$D8, CSV!$E:$E, 0)), \"\", \"〇\")","v":""},{"$f":"IF( ISNA(MATCH(U$5&$E8, CSV!$E:$E, 0)), \"\", \"〇\")","v":""}]
[null,null,null,null,null,{"$f":"IF( ISNA(MATCH($F$5&C9, CSV!$E:$E, 0)), \"\", \"〇\")","v":""},{"$f":"IF( ISNA(MATCH($F$5&D9, CSV!$E:$E, 0)), \"\", \"〇\")","v":""},{"$f":"IF( ISNA(MATCH($F$5&E9, CSV!$E:$E, 0)), \"\", \"〇\")","v":""},{"$f":"IF( ISNA(MATCH($I$5&C9, CSV!$E:$E, 0)), \"\", \"〇\")","v":""},{"$f":"IF( ISNA(MATCH($I$5&D9, CSV!$E:$E, 0)), \"\", \"〇\")","v":""},{"$f":"IF( ISNA(MATCH($I$5&E9, CSV!$E:$E, 0)), \"\", \"〇\")","v":""},{"$f":"IF( ISNA(MATCH($L$5&C9, CSV!$E:$E, 0)), \"\", \"〇\")","v":""},{"$f":"IF( ISNA(MATCH($L$5&D9, CSV!$E:$E, 0)), \"\", \"〇\")","v":""},{"$f":"IF( ISNA(MATCH($L$5&E9, CSV!$E:$E, 0)), \"\", \"〇\")","v":""},{"$f":"IF( ISNA(MATCH(O$5&C9, CSV!$E:$E, 0)), \"\", \"〇\")","v":""},{"$f":"IF( ISNA(MATCH(O$5&D9, CSV!$E:$E, 0)), \"\", \"〇\")","v":""},{"$f":"IF( ISNA(MATCH(O$5&E9, CSV!$E:$E, 0)), \"\", \"〇\")","v":""},{"$f":"IF( ISNA(MATCH(R$5&C9, CSV!$E:$E, 0)), \"\", \"〇\")","v":""},{"$f":"IF( ISNA(MATCH(R$5&D9, CSV!$E:$E, 0)), \"\", \"〇\")","v":""},{"$f":"IF( ISNA(MATCH(R$5&E9, CSV!$E:$E, 0)), \"\", \"〇\")","v":""},{"$f":"IF( ISNA(MATCH(U$5&$C9, CSV!$E:$E, 0)), \"\", \"〇\")","v":""},{"$f":"IF( ISNA(MATCH(U$5&$D9, CSV!$E:$E, 0)), \"\", \"〇\")","v":""},{"$f":"IF( ISNA(MATCH(U$5&$E9, CSV!$E:$E, 0)), \"\", \"〇\")","v":""}]
["マムージャT2","イリズイマ","セニョリータパママ","イリズイマの毛皮","萌葱の割符",{"$f":"IF( ISNA(MATCH($F$5&C10, CSV!$E:$E, 0)), \"\", \"〇\")","v":""},{"$f":"IF( ISNA(MATCH($F$5&D10, CSV!$E:$E, 0)), \"\", \"〇\")","v":""},{"$f":"IF( ISNA(MATCH($F$5&E10, CSV!$E:$E, 0)), \"\", \"〇\")","v":""},{"$f":"IF( ISNA(MATCH($I$5&C10, CSV!$E:$E, 0)), \"\", \"〇\")","v":""},{"$f":"IF( ISNA(MATCH($I$5&D10, CSV!$E:$E, 0)), \"\", \"〇\")","v":""},{"$f":"IF( ISNA(MATCH($I$5&E10, CSV!$E:$E, 0)), \"\", \"〇\")","v":""},{"$f":"IF( ISNA(MATCH($L$5&C10, CSV!$E:$E, 0)), \"\", \"〇\")","v":""},{"$f":"IF( ISNA(MATCH($L$5&D10, CSV!$E:$E, 0)), \"\", \"〇\")","v":""},{"$f":"IF( ISNA(MATCH($L$5&E10, CSV!$E:$E, 0)), \"\", \"〇\")","v":""},{"$f":"IF( ISNA(MATCH(O$5&C10, CSV!$E:$E, 0)), \"\", \"〇\")","v":""},{"$f":"IF( ISNA(MATCH(O$5&D10, CSV!$E:$E, 0)), \"\", \"〇\")","v":""},{"$f":"IF( ISNA(MATCH(O$5&E10, CSV!$E:$E, 0)), \"\", \"〇\")","v":""},{"$f":"IF( ISNA(MATCH(R$5&C10, CSV!$E:$E, 0)), \"\", \"〇\")","v":""},{"$f":"IF( ISNA(MATCH(R$5&D10, CSV!$E:$E, 0)), \"\", \"〇\")","v":""},{"$f":"IF( ISNA(MATCH(R$5&E10, CSV!$E:$E, 0)), \"\", \"〇\")","v":""},{"$f":"IF( ISNA(MATCH(U$5&$C10, CSV!$E:$E, 0)), \"\", \"〇\")","v":""},{"$f":"IF( ISNA(MATCH(U$5&$D10, CSV!$E:$E, 0)), \"\", \"〇\")","v":""},{"$f":"IF( ISNA(MATCH(U$5&$E10, CSV!$E:$E, 0)), \"\", \"〇\")","v":""}]
{"$rows_left_out":48}
{"sheet":"アビセア","index":5,"n_rows":175,"n_cols":10,"rows_kept":175,"cut":false,"hidden":false,"merged":[]}
[]
[]
[]
[]
[null,null,null,null,"Char1","Char2","Char3","Char4","Char5","Char6"]
["コンシュタット","Eccentric Eve","Gangly Gean","香り立つトレントの花びら",{"$f":"IF( ISNA(MATCH(E$5&$D6, CSV!$E:$E, 0)), \"\", \"〇\")","v":""},{"$f":"IF( ISNA(MATCH(F$5&$D6, CSV!$E:$E, 0)), \"\", \"〇\")","v":""},{"$f":"IF( ISNA(MATCH(G$5&$D6, CSV!$E:$E, 0)), \"\", \"〇\")","v":""},{"$f":"IF( ISNA(MATCH(H$5&$D6, CSV!$E:$E, 0)), \"\", \"〇\")","v":""},{"$f":"IF( ISNA(MATCH(I$5&$D6, CSV!$E:$E, 0)), \"\", \"〇\")","v":""},{"$f":"IF( ISNA(MATCH(J$5&$D6, CSV!$E:$E, 0)), \"\", \"〇\")","v":""}]
[null,null,"Raskovnik","臭うラフレシアのつる",{"$f":"IF( ISNA(MATCH(E$5&$D7, CSV!$E:$E, 0)), \"\", \"〇\")","v":""},{"$f":"IF( ISNA(MATCH(F$5&$D7, CSV!$E:$E, 0)), \"\", \"〇\")","v":""},{"$f":"IF( ISNA(MATCH(G$5&$D7, CSV!$E:$E, 0)), \"\", \"〇\")","v":""},{"$f":"IF( ISNA(MATCH(H$5&$D7, CSV!$E:$E, 0)), \"\", \"〇\")","v":""},{"$f":"IF( ISNA(MATCH(I$5&$D7, CSV!$E:$E, 0)), \"\", \"〇\")","v":""},{"$f":"IF( ISNA(MATCH(J$5&$D7, CSV!$E:$E, 0)), \"\", \"〇\")","v":""}]
[null,null,"Clingy Clare","穴が開いたモルボルの牙",{"$f":"IF( ISNA(MATCH(E$5&$D8, CSV!$E:$E, 0)), \"\", \"〇\")","v":""},{"$f":"IF( ISNA(MATCH(F$5&$D8, CSV!$E:$E, 0)), \"\", \"〇\")","v":""},{"$f":"IF( ISNA(MATCH(G$5&$D8, CSV!$E:$E, 0)), \"\", \"〇\")","v":""},{"$f":"IF( ISNA(MATCH(H$5&$D8, CSV!$E:$E, 0)), \"\", \"〇\")","v":""},{"$f":"IF( ISNA(MATCH(I$5&$D8, CSV!$E:$E, 0)), \"\", \"〇\")","v":""},{"$f":"IF( ISNA(MATCH(J$5&$D8, CSV!$E:$E, 0)), \"\", \"〇\")","v":""}]
[null,null,null,"ミニモルボルのつる",{"$f":"IF( ISNA(MATCH(E$5&$D9, CSV!$E:$E, 0)), \"\", \"〇\")","v":""},{"$f":"IF( ISNA(MATCH(F$5&$D9, CSV!$E:$E, 0)), \"\", \"〇\")","v":""},{"$f":"IF( ISNA(MATCH(G$5&$D9, CSV!$E:$E, 0)), \"\", \"〇\")","v":""},{"$f":"IF( ISNA(MATCH(H$5&$D9, CSV!$E:$E, 0)), \"\", \"〇\")","v":""},{"$f":"IF( ISNA(MATCH(I$5&$D9, CSV!$E:$E, 0)), \"\", \"〇\")","v":""},{"$f":"IF( ISNA(MATCH(J$5&$D9, CSV!$E:$E, 0)), \"\", \"〇\")","v":""}]
[null,null,"Fistule","濁ったスライムのオイル",{"$f":"IF( ISNA(MATCH(E$5&$D10, CSV!$E:$E, 0)), \"\", \"〇\")","v":""},{"$f":"IF( ISNA(MATCH(F$5&$D10, CSV!$E:$E, 0)), \"\", \"〇\")","v":""},{"$f":"IF( ISNA(MATCH(G$5&$D10, CSV!$E:$E, 0)), \"\", \"〇\")","v":""},{"$f":"IF( ISNA(MATCH(H$5&$D10, CSV!$E:$E, 0)), \"\", \"〇\")","v":""},{"$f":"IF( ISNA(MATCH(I$5&$D10, CSV!$E:$E, 0)), \"\", \"〇\")","v":""},{"$f":"IF( ISNA(MATCH(J$5&$D10, CSV!$E:$E, 0)), \"\", \"〇\")","v":""}]
{"$rows_left_out":166}
{"sheet":"リンバス","index":6,"n_rows":24,"n_cols":12,"rows_kept":24,"cut":false,"hidden":false,"merged":[]}
[]
[]
[]
[]
[null,null,null,null,"Char1","Char2","Char3","Char4","Char5","Char6"]
["Omega","アポリオンCN","スマルトチップ","SE #3",{"$f":"IF( ISNA(MATCH(E$5&$C6, CSV!$E:$E, 0)), \"\", \"〇\")","v":""},{"$f":"IF( ISNA(MATCH(F$5&$C6, CSV!$E:$E, 0)), \"\", \"〇\")","v":""},{"$f":"IF( ISNA(MATCH(G$5&$C6, CSV!$E:$E, 0)), \"\", \"〇\")","v":""},{"$f":"IF( ISNA(MATCH(H$5&$C6, CSV!$E:$E, 0)), \"\", \"〇\")","v":""},{"$f":"IF( ISNA(MATCH(I$5&$C6, CSV!$E:$E, 0)), \"\", \"〇\")","v":""},{"$f":"IF( ISNA(MATCH(J$5&$C6, CSV!$E:$E, 0)), \"\", \"〇\")","v":""},{"$f":"COUNTIF(E6:J6, \"〇\")","v":0},"ブラックカード"]
[null,null,"スモーキーチップ","NE #3",{"$f":"IF( ISNA(MATCH(E$5&$C7, CSV!$E:$E, 0)), \"\", \"〇\")","v":""},{"$f":"IF( ISNA(MATCH(F$5&$C7, CSV!$E:$E, 0)), \"\", \"〇\")","v":""},{"$f":"IF( ISNA(MATCH(G$5&$C7, CSV!$E:$E, 0)), \"\", \"〇\")","v":""},{"$f":"IF( ISNA(MATCH(H$5&$C7, CSV!$E:$E, 0)), \"\", \"〇\")","v":""},{"$f":"IF( ISNA(MATCH(I$5&$C7, CSV!$E:$E, 0)), \"\", \"〇\")","v":""},{"$f":"IF( ISNA(MATCH(J$5&$C7, CSV!$E:$E, 0)), \"\", \"〇\")","v":""},{"$f":"COUNTIF(E7:J7, \"〇\")","v":0},"ブラックカード"]
[null,null,"チャコールチップ","SW #2",{"$f":"IF( ISNA(MATCH(E$5&$C8, CSV!$E:$E, 0)), \"\", \"〇\")","v":""},{"$f":"IF( ISNA(MATCH(F$5&$C8, CSV!$E:$E, 0)), \"\", \"〇\")","v":""},{"$f":"IF( ISNA(MATCH(G$5&$C8, CSV!$E:$E, 0)), \"\", \"〇\")","v":""},{"$f":"IF( ISNA(MATCH(H$5&$C8, CSV!$E:$E, 0)), \"\", \"〇\")","v":""},{"$f":"IF( ISNA(MATCH(I$5&$C8, CSV!$E:$E, 0)), \"\", \"〇\")","v":""},{"$f":"IF( ISNA(MATCH(J$5&$C8, CSV!$E:$E, 0)), \"\", \"〇\")","v":""},{"$f":"COUNTIF(E8:J8, \"〇\")","v":0},"レッドカード"]
[null,null,"マゼンタチップ","NW #2",{"$f":"IF( ISNA(MATCH(E$5&$C9, CSV!$E:$E, 0)), \"\", \"〇\")","v":""},{"$f":"IF( ISNA(MATCH(F$5&$C9, CSV!$E:$E, 0)), \"\", \"〇\")","v":""},{"$f":"IF( ISNA(MATCH(G$5&$C9, CSV!$E:$E, 0)), \"\", \"〇\")","v":""},{"$f":"IF( ISNA(MATCH(H$5&$C9, CSV!$E:$E, 0)), \"\", \"〇\")","v":""},{"$f":"IF( ISNA(MATCH(I$5&$C9, CSV!$E:$E, 0)), \"\", \"〇\")","v":""},{"$f":"IF( ISNA(MATCH(J$5&$C9, CSV!$E:$E, 0)), \"\", \"〇\")","v":""},{"$f":"COUNTIF(E9:J9, \"〇\")","v":0},"レッドカード"]
[null,null,"ブラックカード",null,{"$f":"IF( ISNA(MATCH(E$5&$C10, CSV!$E:$E, 0)), \"\", \"〇\")","v":""},{"$f":"IF( ISNA(MATCH(F$5&$C10, CSV!$E:$E, 0)), \"\", \"〇\")","v":""},{"$f":"IF( ISNA(MATCH(G$5&$C10, CSV!$E:$E, 0)), \"\", \"〇\")","v":""},{"$f":"IF( ISNA(MATCH(H$5&$C10, CSV!$E:$E, 0)), \"\", \"〇\")","v":""},{"$f":"IF( ISNA(MATCH(I$5&$C10, CSV!$E:$E, 0)), \"\", \"〇\")","v":""},{"$f":"IF( ISNA(MATCH(J$5&$C10, CSV!$E:$E, 0)), \"\", \"〇\")","v":""}]
{"$rows_left_out":15}
{"sheet":"空４神","index":7,"n_rows":49,"n_cols":12,"rows_kept":49,"cut":false,"hidden":false,"merged":[]}
[]
[]
[]
[]
[null,null,null,null,"Char1","Char2","Char3","Char4","Char5","Char6"]
[]
[null,"青龍","春石",null,{"$f":"IF( ISNA(MATCH(E$5&$C7, CSV!$E:$E, 0)), \"\", \"〇\")","v":""},{"$f":"IF( ISNA(MATCH(F$5&$C7, CSV!$E:$E, 0)), \"\", \"〇\")","v":""},{"$f":"IF( ISNA(MATCH(G$5&$C7, CSV!$E:$E, 0)), \"\", \"〇\")","v":""},{"$f":"IF( ISNA(MATCH(H$5&$C7, CSV!$E:$E, 0)), \"\", \"〇\")","v":""},{"$f":"IF( ISNA(MATCH(I$5&$C7, CSV!$E:$E, 0)), \"\", \"〇\")","v":""},{"$f":"IF( ISNA(MATCH(J$5&$C7, CSV!$E:$E, 0)), \"\", \"〇\")","v":""},null,"Mother Globe"]
[null,null,"東玉",null,{"$f":"IF( ISNA(MATCH(E$5&$C8, CSV!$E:$E, 0)), \"\", \"〇\")","v":""},{"$f":"IF( ISNA(MATCH(F$5&$C8, CSV!$E:$E, 0)), \"\", \"〇\")","v":""},{"$f":"IF( ISNA(MATCH(G$5&$C8, CSV!$E:$E, 0)), \"\", \"〇\")","v":""},{"$f":"IF( ISNA(MATCH(H$5&$C8, CSV!$E:$E, 0)), \"\", \"〇\")","v":""},{"$f":"IF( ISNA(MATCH(I$5&$C8, CSV!$E:$E, 0)), \"\", \"〇\")","v":""},{"$f":"IF( ISNA(MATCH(J$5&$C8, CSV!$E:$E, 0)), \"\", \"〇\")","v":""},null,"Steam Cleaner"]
[null,"朱雀","夏石",null,{"$f":"IF( ISNA(MATCH(E$5&$C9, CSV!$E:$E, 0)), \"\", \"〇\")","v":""},{"$f":"IF( ISNA(MATCH(F$5&$C9, CSV!$E:$E, 0)), \"\", \"〇\")","v":""},{"$f":"IF( ISNA(MATCH(G$5&$C9, CSV!$E:$E, 0)), \"\", \"〇\")","v":""},{"$f":"IF( ISNA(MATCH(H$5&$C9, CSV!$E:$E, 0)), \"\", \"〇\")","v":""},{"$f":"IF( ISNA(MATCH(I$5&$C9, CSV!$E:$E, 0)), \"\", \"〇\")","v":""},{"$f":"IF( ISNA(MATCH(J$5&$C9, CSV!$E:$E, 0)), \"\", \"〇\")","v":""},null,"Faust"]
[null,null,"南玉",null,{"$f":"IF( ISNA(MATCH(E$5&$C10, CSV!$E:$E, 0)), \"\", \"〇\")","v":""},{"$f":"IF( ISNA(MATCH(F$5&$C10, CSV!$E:$E, 0)), \"\", \"〇\")","v":""},{"$f":"IF( ISNA(MATCH(G$5&$C10, CSV!$E:$E, 0)), \"\", \"〇\")","v":""},{"$f":"IF( ISNA(MATCH(H$5&$C10, CSV!$E:$E, 0)), \"\", \"〇\")","v":""},{"$f":"IF( ISNA(MATCH(I$5&$C10, CSV!$E:$E, 0)), \"\", \"〇\")","v":""},{"$f":"IF( ISNA(MATCH(J$5&$C10, CSV!$E:$E, 0)), \"\", \"〇\")","v":""},null,"Brigandish Blade"]
{"$rows_left_out":40}
{"sheet":"七元徳","index":8,"n_rows":40,"n_cols":11,"rows_kept":40,"cut":false,"hidden":false,"merged":[]}
[]
[]
[]
[]
[null,null,null,"トリガー","Char1","Char2","Char3","Char4","Char5","Char6"]
[]
[]
[]
[]
[]
{"$rows_left_out":31}
{"sheet":"ログ","index":9,"n_rows":5,"n_cols":5,"rows_kept":5,"cut":false,"hidden":false,"merged":[]}
[]
[]
[]
[]
["キャラ名","アイテム","セル","エラー","オーグメント"]

{"sheet":"Char6","index":10,"n_rows":0,"n_cols":0,"rows_kept":0,"cut":false,"hidden":false,"merged":[]}

{"sheet":"Char5","index":11,"n_rows":0,"n_cols":0,"rows_kept":0,"cut":false,"hidden":false,"merged":[]}

{"sheet":"Char4","index":12,"n_rows":0,"n_cols":0,"rows_kept":0,"cut":false,"hidden":false,"merged":[]}

{"sheet":"Char3","index":13,"n_rows":0,"n_cols":0,"rows_kept":0,"cut":false,"hidden":false,"merged":[]}

{"sheet":"Char2","index":14,"n_rows":0,"n_cols":0,"rows_kept":0,"cut":false,"hidden":false,"merged":[]}

{"sheet":"Char1","index":15,"n_rows":0,"n_cols":0,"rows_kept":0,"cut":false,"hidden":false,"merged":[]}

{"sheet":"CSV","index":16,"n_rows":0,"n_cols":0,"rows_kept":0,"cut":false,"hidden":false,"merged":[]}

{"sheet":"tmp","index":17,"n_rows":659,"n_cols":1,"rows_kept":659,"cut":false,"hidden":true,"merged":[]}
[]
[]
[]
[]
["sets.exported={"]
["item=\"リフトドロス\","]
["item=\"モグチケット【銀】\","]
["item=\"リフトシンダー\","]
["waist=\"ニヌルタサッシュ\","]
["item=\"モグチケット【金】\","]
{"$rows_left_out":649}